ip_address,name,as_number,as_org,country_code,city,version,error,dnssec,reliability,checked_at,created_at
206.132.225.187,host-206-132-225-187.metrompls.com.,262248,Metro MPLS,PA,Panama City,,,false,1.00,2022-08-07T01:14:34Z,2022-08-07T01:14:34Z
64.210.64.138,host-64-210-64-138.metrompls.com.,262248,Metro MPLS,PA,Panama City,,,false,1.00,2022-08-07T01:29:47Z,2022-08-07T01:29:47Z
190.219.14.233,cpe-d85d4ccf3a6f.cpe.cableonda.net.,18809,Cable Onda,PA,Panama City,,,false,0.97,2023-02-25T20:46:25Z,2022-10-29T08:13:01Z
190.218.115.4,,18809,Cable Onda,PA,Panama City,dnsmasq-2.40,,true,1.00,2022-11-11T00:58:27Z,2022-11-04T05:21:12Z
190.219.111.214,cpe-0019b93f7ad2.cpe.cableonda.net.,18809,Cable Onda,PA,Panama City,dnsmasq-2.76,,false,1.00,2022-11-13T15:03:16Z,2022-11-13T15:03:16Z
190.5.233.154,,21599,Cable Onda,PA,Panama City,9.11.4-P2-RedHat-9.11.4-26.P2.el7_9.8,,true,1.00,2022-12-06T22:00:43Z,2022-11-16T01:12:59Z
200.46.65.66,,21599,Cable Onda,PA,Panama City,,,false,1.00,2022-12-06T23:48:12Z,2022-11-22T02:12:58Z
190.218.213.165,,18809,Cable Onda,PA,Panama City,dnsmasq-2.40,,true,1.00,2022-12-06T23:51:20Z,2022-11-25T19:05:56Z
190.218.118.142,,18809,Cable Onda,PA,Panama City,,,false,1.00,2022-12-06T23:53:46Z,2022-11-28T23:51:30Z
190.140.202.124,,18809,Cable Onda,PA,Panama City,bind,,false,1.00,2022-12-07T00:45:01Z,2022-12-01T07:22:51Z
138.99.139.124,,61497,VOZELIA SA,PA,Panama City,,,true,0.40,2023-02-19T12:02:11Z,2022-12-11T17:20:15Z
190.2.239.76,,18809,Cable Onda,PA,,dnsmasq-2.40,,true,1.00,2023-02-19T06:07:24Z,2022-12-22T18:24:08Z
190.218.153.88,cpe-10feed5500b1.cpe.cableonda.net.,18809,Cable Onda,PA,Panama City,dnsmasq-2.40,,false,1.00,2023-02-19T07:58:57Z,2022-12-29T08:54:59Z
190.219.128.7,cpe-dc9b9c4bdcfa.cpe.cableonda.net.,18809,Cable Onda,PA,Panama City,,,false,0.97,2023-02-19T20:02:15Z,2023-01-02T14:54:57Z
181.78.122.17,17.122.78.181.ufinet.com.pa.,52468,UFINET PANAMA S.A.,PA,,,,false,0.89,2023-02-20T05:02:34Z,2023-01-03T08:14:00Z
190.219.182.91,,18809,Cable Onda,PA,Panama City,dnsmasq-2.76,,false,1.00,2023-03-01T00:48:20Z,2023-02-27T18:01:15Z
190.141.112.230,,18809,Cable Onda,PA,Panama City,dnsmasq-2.62,,false,0.99,2023-03-09T03:55:23Z,2023-03-05T23:28:54Z
45.181.68.65,ns2.fusilsystem.com.,269736,PACIFIC NETWORK COMMUNICATION S.A.,PA,Panama City,9.11.5-P4-5.1-Debian,,false,1.00,2023-03-15T03:44:57Z,2023-03-10T09:37:21Z
190.14.203.242,242.203.14.190.clarocom.com.,27796,Galaxy Communications,PA,Panama City,,,false,1.00,2023-03-12T07:47:11Z,2023-03-11T06:05:30Z
201.218.219.210,,21599,Cable Onda,PA,Panama City,,,false,1.00,2023-03-13T03:52:41Z,2023-03-13T03:52:41Z
190.141.25.231,,18809,Cable Onda,PA,Panama City,,,false,1.00,2023-03-13T08:06:01Z,2023-03-13T08:06:01Z
186.75.32.30,,11556,Cable & Wireless Panama,PA,Panama City,,,false,1.00,2023-03-13T12:47:45Z,2023-03-13T12:30:05Z
186.72.37.54,,11556,Cable & Wireless Panama,PA,Panama City,9.11.22,,false,1.00,2023-03-15T09:48:06Z,2023-03-13T16:00:47Z
190.5.245.107,,21599,Cable Onda,PA,Panama City,dnsmasq-2.83,,false,1.00,2023-03-15T09:49:32Z,2023-03-13T18:06:51Z
200.46.99.178,178-99-46-200-ip.alianzaviva.net.,21599,Cable Onda,PA,Panama City,,,false,1.00,2023-03-15T09:49:59Z,2023-03-13T18:47:36Z
190.33.191.246,,11556,Cable & Wireless Panama,PA,David,unbound 1.4.22,,false,1.00,2023-03-14T03:24:59Z,2023-03-14T03:24:59Z
190.218.81.46,cpe-8ce748418f74.cpe.cableonda.net.,18809,Cable Onda,PA,Panama City,dnsmasq-2.40,,true,1.00,2023-03-15T04:50:57Z,2023-03-14T14:04:16Z
200.115.133.140,140-IPA.133.115.200.in-addr.arpa.,21599,Cable Onda,PA,Colón,9.6-ESV-R11,,false,1.00,2023-03-15T04:51:55Z,2023-03-14T15:42:49Z
190.35.38.231,,11556,Cable & Wireless Panama,PA,Panama City,,,false,1.00,2023-03-15T04:54:49Z,2023-03-14T20:09:20Z
190.109.2.242,,262191,COLUMBUS NETWORKS COLOMBIA,PA,,,,false,1.00,2023-03-15T04:54:49Z,2023-03-14T20:09:48Z
200.108.46.242,,14709,Cable Onda,PA,Panama City,,,false,1.00,2023-03-15T09:57:22Z,2023-03-14T21:42:03Z
190.2.239.75,,18809,Cable Onda,PA,,dnsmasq-2.33,,true,1.00,2023-03-18T02:53:19Z,2023-03-15T11:04:56Z
201.221.237.39,,27928,Liberty Technologies Corp.,PA,Panama City,,,false,1.00,2023-03-18T02:53:59Z,2023-03-15T12:10:08Z
201.218.125.251,cm-201-218-125-251.cpe-statics.cableonda.net.,18809,Cable Onda,PA,Panama City,,,false,0.94,2023-03-18T02:55:46Z,2023-03-15T15:13:16Z
181.197.177.56,,18809,Cable Onda,PA,Panama City,dnsmasq-2.40,,true,1.00,2023-03-18T02:56:01Z,2023-03-15T15:41:24Z
201.224.85.115,,11556,Cable & Wireless Panama,PA,Panama City,UNKNOWN,,true,0.90,2023-04-11T19:13:09Z,2023-03-16T09:51:34Z
190.141.13.145,,18809,Cable Onda,PA,Panama City,,,false,0.69,2023-04-21T17:42:03Z,2023-03-16T22:02:47Z
181.197.49.122,,18809,Cable Onda,PA,Panama City,dnsmasq-2.62,,false,0.70,2023-04-21T17:42:36Z,2023-03-16T22:53:39Z
190.140.30.106,,18809,Cable Onda,PA,Panama City,,,false,0.75,2023-04-21T21:47:36Z,2023-03-17T05:59:21Z
190.14.18.34,,265867,Trans Ocean Network,PA,Panama City,,,false,0.80,2023-04-21T21:49:15Z,2023-03-17T08:39:37Z
190.109.2.244,,262191,COLUMBUS NETWORKS COLOMBIA,PA,,,,false,0.92,2023-05-08T07:52:25Z,2023-03-17T15:28:08Z
38.87.252.146,,28007,Gold Data C.A.,PA,Panama City,unbound 1.4.22,,false,1.00,2023-08-17T15:55:22Z,2023-03-19T05:56:44Z
